'암호화'에 해당되는 글 1건

php_screw-1.5/php_screw.c:124: error: ‘struct _zend_compiler_globals’ has no member named ‘extended_info’
php_screw-1.5/php_screw.c: In function ‘zm_shutdown_php_screw’:
php_screw-1.5/php_screw.c:133: error: ‘struct _zend_compiler_globals’ has no member named ‘extended_info’
make: *** [php_screw.lo] Error 1

이러한 에러가 날 경우, 위의 에러메시지의 라인 124, 133을 찾아보면 CG(extended_info) = 1; 라고 적혀있는데, 이것을 주석처리하거나 삭제한 뒤, 다시 make 하면 된다.
블로그 이미지

Seowon Jung jswlinux

Seowon Jung의 잡동사니 보관소

댓글을 달아 주세요